BDBM50547986 CHEMBL4786638
SMILES N[C@H]1CC[C@@H](CC1)Nc1ncnc2c(csc12)C(=O)Nc1c(Cl)ccc(NS(=O)(=O)c2cc(F)ccc2F)c1F
InChI Key InChIKey=NALUYXQOXMHJMM-HDJSIYSDSA-N
Data  1 KI  2 IC50
PDB links: 1 PDB ID matches this monomer.
  Tab Delimited (TSV)   2D SDfile   Computed 3D by Vconf -m prep SDfile
Find this compound or compounds like it in BindingDB:
Activity Spreadsheet -- Enzyme Inhibition Constant Data from BindingDB
Found 3 hits for monomerid = 50547986
TargetSerine/threonine-protein kinase B-raf(Homo sapiens (Human))
Paraza Pharma
Curated by ChEMBL
LigandPNGBDBM50547986(CHEMBL4786638)
Affinity DataKi:  1.40nM. Assay description: Inhibition of of human recombinant His6-tagged B-Raf V600E mutant expressed in baculovirus infected cells co-expresing CDC37 in presence of [gamma33P...
Ligand InfoPC cidPC sidPDB
In DepthDetails ArticlePubMed
TargetSerine/threonine-protein kinase/endoribonuclease IRE1(Homo sapiens (Human))
Paraza Pharma
Curated by ChEMBL
LigandPNGBDBM50547986(CHEMBL4786638)
Affinity DataIC50:  24nM. Assay description: Competitive inhibition of IRE1alpha LKR domain (Q470 to L997 residues) (unknown origin) expressed in Sf9 insect cells using mini-XBP-1 stem-loop RNA ...
Ligand InfoPC cidPC sidPDB
TargetSerine/threonine-protein kinase/endoribonuclease IRE1(Homo sapiens (Human))
Paraza Pharma
Curated by ChEMBL
LigandPNGBDBM50547986(CHEMBL4786638)
Affinity DataIC50:  320nM. Assay description: Inhibition of IRE1alpha (unknown origin) assessed as XBP-1 slicing luciferase activity incubated for 1 hr followed by stimulation with thapsigargin m...
Ligand InfoPC cidPC sidPDB