BDBM50548656 CHEMBL4741882
SMILES FC(F)(F)CN1Cc2c(C[C@@H](CC(=O)N3CCC(CC3)N3Cc4ccccc4NC3=O)C1=O)cc(Cl)c1[nH]ncc21
InChI Key InChIKey=BZGGZTXYNYSIPK-SFHVURJKSA-N
Data  1 KI
  Tab Delimited (TSV)   2D SDfile   Computed 3D by Vconf -m prep SDfile
Find this compound or compounds like it in BindingDB:
Activity Spreadsheet -- Enzyme Inhibition Constant Data from BindingDB
Found 1 hit for monomerid = 50548656
TargetCalcitonin gene-related peptide type 1 receptor(Homo sapiens (Human))
Bristol-Myers Squibb
Curated by ChEMBL
LigandPNGBDBM50548656(CHEMBL4741882)
Affinity DataKi:  0.230nM. Assay description: Antagonist activity at human CGRP receptor
Ligand InfoPC cidPC sid
In DepthDetails ArticlePubMed