BDBM50548664 CHEMBL4779094
SMILES O=C(N[C@@H]1Cc2ccc3[nH]ncc3c2CN(CCN2CCOCC2)C1=O)N1CCC(CC1)N1Cc2ccccc2NC1=O
InChI Key InChIKey=FBOVTLSMLAWMLR-MUUNZHRXSA-N
Data  1 KI
  Tab Delimited (TSV)   2D SDfile   Computed 3D by Vconf -m prep SDfile
Find this compound or compounds like it in BindingDB:
Activity Spreadsheet -- Enzyme Inhibition Constant Data from BindingDB
Found 1 hit for monomerid = 50548664
TargetCalcitonin gene-related peptide type 1 receptor(Homo sapiens (Human))
Bristol-Myers Squibb
Curated by ChEMBL
LigandPNGBDBM50548664(CHEMBL4779094)
Affinity DataKi:  50nM. Assay description: Antagonist activity at human CGRP receptor
Ligand InfoPC cidPC sid
In DepthDetails ArticlePubMed