BDBM50549228 CHEMBL4758706
SMILES CCCC[C@H](N(C)C(=O)[C@H](Cc1c[nH]c2ccccc12)NC(=O)[C@@H]1CCCN1C(=O)[C@H](Cc1ccc(O)cc1)NC(=O)[C@H](C)NC(=O)[C@@H](CCC(O)=O)NC(=O)CN1CCN(CC(O)=O)CCN(CC(O)=O)CCN(CC(O)=O)CC1)C(=O)N[C@@H](CC(O)=O)C(=O)N[C@@H](Cc1cccc2ccccc12)C(N)=O
InChI Key InChIKey=HWGZSWNNZSPKNV-LKARYRLESA-N
Data  1 IC50  2 EC50
  Tab Delimited (TSV)   2D SDfile   Computed 3D by Vconf -m prep SDfile
Find this compound or compounds like it in BindingDB:
Activity Spreadsheet -- Enzyme Inhibition Constant Data from BindingDB
Found 3 hits for monomerid = 50549228
TargetGastrin/cholecystokinin type B receptor(Homo sapiens (Human))
Medical University Of Innsbruck
Curated by ChEMBL
LigandPNGBDBM50549228(CHEMBL4758706)
Affinity DataIC50:  1.30nM. Assay description: Displacement of [125I][3-iodo Tyr12,Leu15]gastrin-I from human CCK2R expressed in human A431 cells measured after 1 hr by gamma counter analysis
Ligand InfoPC cidPC sid
In DepthDetails ArticlePubMed
TargetGastrin/cholecystokinin type B receptor(RAT)
Medical University Of Innsbruck
Curated by ChEMBL
LigandPNGBDBM50549228(CHEMBL4758706)
Affinity DataEC50:  1.30nM. Assay description: Agonist activity at rat CCK2R expressed in rat AR42J cells assessed as intracellular calcium mobilization measured after 24 hrs by Fluo-4AM dye based...
Ligand InfoPC cidPC sid
In DepthDetails ArticlePubMed
TargetGastrin/cholecystokinin type B receptor(Homo sapiens (Human))
Medical University Of Innsbruck
Curated by ChEMBL
LigandPNGBDBM50549228(CHEMBL4758706)
Affinity DataEC50:  12nM. Assay description: Agonist activity at human CCK2R expressed in human A431 cells assessed as intracellular calcium mobilization measured after 24 hrs by Fluo-4AM dye ba...
Ligand InfoPC cidPC sid
In DepthDetails ArticlePubMed