BDBM50549627 CHEMBL4744507
SMILES ON(C(=O)Nc1ccc2nnsc2c1)c1ccccc1
InChI Key InChIKey=YJYZCPIQZWSNDF-UHFFFAOYSA-N
Data  1 Kd
  Tab Delimited (TSV)   2D SDfile   Computed 3D by Vconf -m prep SDfile
Find this compound or compounds like it in BindingDB:
Activity Spreadsheet -- Enzyme Inhibition Constant Data from BindingDB
Found 1 hit for monomerid = 50549627
TargetBromodomain adjacent to zinc finger domain protein 1A(Homo sapiens)
Sichuan Provincial People'S Hospital
Curated by ChEMBL
LigandPNGBDBM50549627(CHEMBL4744507)
Affinity DataKd:  1.63E+4nM. Assay description: Binding affinity to recombinant human N-terminal His6-tagged BAZ1A (1446 to 1516 residues) expressed in Escherichia coli BL21 (DE3) cells by MST assa...
Ligand InfoPC cidPC sid
In DepthDetails ArticlePubMed