BDBM50549629 CHEMBL4743849
SMILES Oc1cccc(NC(=O)Nc2ccc(cc2)C(F)(F)F)c1
InChI Key InChIKey=SIQNVINFEPDDQG-UHFFFAOYSA-N
Data  1 Kd
  Tab Delimited (TSV)   2D SDfile   Computed 3D by Vconf -m prep SDfile
Find this compound or compounds like it in BindingDB:
Activity Spreadsheet -- Enzyme Inhibition Constant Data from BindingDB
Found 1 hit for monomerid = 50549629
TargetBromodomain adjacent to zinc finger domain protein 1A(Homo sapiens)
Sichuan Provincial People'S Hospital
Curated by ChEMBL
LigandPNGBDBM50549629(CHEMBL4743849)
Affinity DataKd:  1.32E+4nM. Assay description: Binding affinity to recombinant human N-terminal His6-tagged BAZ1A (1446 to 1516 residues) expressed in Escherichia coli BL21 (DE3) cells by MST assa...
Ligand InfoPC cidPC sid
In DepthDetails ArticlePubMed