BDBM50549630 CHEMBL4740348
SMILES Clc1ccc(NC(=O)Nc2ccc3nnsc3c2)cc1Cl
InChI Key InChIKey=NUUSUAWULNXMGF-UHFFFAOYSA-N
Data  1 Kd
  Tab Delimited (TSV)   2D SDfile   Computed 3D by Vconf -m prep SDfile
Find this compound or compounds like it in BindingDB:
Activity Spreadsheet -- Enzyme Inhibition Constant Data from BindingDB
Found 1 hit for monomerid = 50549630
TargetBromodomain adjacent to zinc finger domain protein 1A(Homo sapiens)
Sichuan Provincial People'S Hospital
Curated by ChEMBL
LigandPNGBDBM50549630(CHEMBL4740348)
Affinity DataKd:  1.57E+3nM. Assay description: Binding affinity to recombinant human N-terminal His6-tagged BAZ1A (1446 to 1516 residues) expressed in Escherichia coli BL21 (DE3) cells by MST assa...
In DepthDetails ArticlePubMed