BDBM50549803 ABT-333::CHEBI:85182::Dasabuvir::Dasabuvir sodium monohydrate::Exviera
SMILES COc1c(cc(cc1C(C)(C)C)-n1ccc(=O)[nH]c1=O)-c1ccc2cc(NS(C)(=O)=O)ccc2c1
InChI Key InChIKey=NBRBXGKOEOGLOI-UHFFFAOYSA-N
Data  1 KI  1 IC50
  Tab Delimited (TSV)   2D SDfile   Computed 3D by Vconf -m prep SDfile
Find this compound or compounds like it in BindingDB:
Activity Spreadsheet -- Enzyme Inhibition Constant Data from BindingDB
Found 2 hits for monomerid = 50549803
TargetProtein cereblon(Homo sapiens (Human))
Max Planck Institute For Developmental Biology
Curated by ChEMBL
LigandPNGBDBM50549803(ABT-333 | CHEBI:85182 | Dasabuvir | Dasabuvir sodi...)
Affinity DataKi:  4.71E+3nM. Assay description: Binding affinity to human CRBN-thalidomide binding domain expressed in Escherichia coli by measuring baseline corrected normalized fluorescence by MS...
In DepthDetails ArticlePubMed
TargetProtein cereblon(Homo sapiens (Human))
Max Planck Institute For Developmental Biology
Curated by ChEMBL
LigandPNGBDBM50549803(ABT-333 | CHEBI:85182 | Dasabuvir | Dasabuvir sodi...)
Affinity DataIC50:  1.56E+4nM. Assay description: Binding affinity to human CRBN-thalidomide binding domain expressed in Escherichia coli by measuring baseline corrected normalized fluorescence by MS...
In DepthDetails ArticlePubMed