BDBM50549810 CHEMBL4797970
SMILES Cn1ccc(=O)[nH]c1=O
InChI Key InChIKey=XBCXJKGHPABGSD-UHFFFAOYSA-N
Data  1 KI  1 IC50
  Tab Delimited (TSV)   2D SDfile   Computed 3D by Vconf -m prep SDfile
Find this compound or compounds like it in BindingDB:
Activity Spreadsheet -- Enzyme Inhibition Constant Data from BindingDB
Found 2 hits for monomerid = 50549810
TargetProtein cereblon(Homo sapiens (Human))
Max Planck Institute For Developmental Biology
Curated by ChEMBL
LigandPNGBDBM50549810(CHEMBL4797970)
Affinity DataKi:  3.08E+4nM. Assay description: Binding affinity to human CRBN-thalidomide binding domain expressed in Escherichia coli by measuring baseline corrected normalized fluorescence by MS...
In DepthDetails ArticlePubMed
TargetProtein cereblon(Homo sapiens (Human))
Max Planck Institute For Developmental Biology
Curated by ChEMBL
LigandPNGBDBM50549810(CHEMBL4797970)
Affinity DataIC50:  6.57E+4nM. Assay description: Binding affinity to human CRBN-thalidomide binding domain expressed in Escherichia coli by measuring baseline corrected normalized fluorescence by MS...
In DepthDetails ArticlePubMed