BDBM50550267 CHEMBL4756835
SMILES C[C@@H]1CN(CCN1c1nccc(n1)C(=O)NC1C2CC3CC1CC(O)(C3)C2)c1c(F)cc(cc1F)S(C)(=O)=O
InChI Key InChIKey=LFAGEAAWGYTYLL-USCKZAIJSA-N
Data  1 IC50
  Tab Delimited (TSV)   2D SDfile   Computed 3D by Vconf -m prep SDfile
Find this compound or compounds like it in BindingDB:
Activity Spreadsheet -- Enzyme Inhibition Constant Data from BindingDB
Found 1 hit for monomerid = 50550267
Target11-beta-hydroxysteroid dehydrogenase 1(Homo sapiens (Human))
Sk Chemicals
Curated by ChEMBL
LigandPNGBDBM50550267(CHEMBL4756835)
Affinity DataIC50:  12nM. Assay description: Inhibition of human 11beta-HSD1 expressed in HEK293 cells using cortisone in presence of NADPH regenerating-system incubated for 1 hr by ELISA
Ligand InfoPC cidPC sid
In DepthDetails ArticlePubMed