BDBM50550346 CHEMBL4558130
SMILES CC(C)[C@@H](O)[C@H](O)C(=O)NS(=O)(=O)OC[C@H]1O[C@H]([C@H](O)[C@@H]1O)n1cnc2c(N)ncnc12
InChI Key InChIKey=GGYLSTAJCRPAFC-XHKGYQPESA-N
Data  1 IC50
  Tab Delimited (TSV)   2D SDfile   Computed 3D by Vconf -m prep SDfile
Find this compound or compounds like it in BindingDB:
Activity Spreadsheet -- Enzyme Inhibition Constant Data from BindingDB
Found 1 hit for monomerid = 50550346
TargetLeucine--tRNA ligase, cytoplasmic(Homo sapiens (Human))
Seoul National University
Curated by ChEMBL
LigandPNGBDBM50550346(CHEMBL4558130)
Affinity DataIC50:  70nM. Assay description: Inhibition of catalytic activity of LRS (unknown origin) by aminoleucylation assay
Ligand InfoPC cidPC sid
In DepthDetails ArticlePubMed