BDBM50550638 CHEMBL4762233
SMILES CC[C@H](C)[C@H](NC(=O)[C@H](CCC(O)=O)NC(=O)[C@@H]1CCCN1C(=O)[C@H](Cc1cnc[nH]1)NC(=O)[C@H](CC(O)=O)NC(=O)[C@H](Cc1ccc(O)cc1)NC(=O)[C@H](CCCNC(N)=N)NC(=O)[C@H](CS)NC(=O)[C@H](CCCNC(N)=N)NC(=O)[C@@H]1CCCN1C(=O)[C@H](CC(O)=O)NC(=O)[C@H](CO)NC(=O)[C@H](CS)NC(=O)[C@H](CS)NC(=O)CNC(C)=O)C(=O)N[C@@H](CS)C(N)=O
InChI Key InChIKey=JXPXSJRYIIVYSJ-HPAWZSKOSA-N
Data  2 IC50
  Tab Delimited (TSV)   2D SDfile   Computed 3D by Vconf -m prep SDfile
Find this compound or compounds like it in BindingDB:
Activity Spreadsheet -- Enzyme Inhibition Constant Data from BindingDB
Found 2 hits for monomerid = 50550638
TargetNicotinic acetylcholine receptor alpha9/alpha10(RAT)
Beijing Institute Of Biotechnology
Curated by ChEMBL
LigandPNGBDBM50550638(CHEMBL4762233)
Affinity DataIC50:  2.42E+3nM. Assay description: Inhibition of rat alpha9alpha10 nAChR expressed in Xenopus laevis oocytes assessed as inhibition of Ach-induced response at -80 mV holding potential ...
Ligand InfoKEGGPC cidPC sid
In DepthDetails ArticlePubMed
TargetGamma-aminobutyric acid type B receptor subunit 1/2(Homo sapiens (Human))
Beijing Institute Of Biotechnology
Curated by ChEMBL
LigandPNGBDBM50550638(CHEMBL4762233)
Affinity DataIC50:  19nM. Assay description: Activation of human GABAB1/GABAB2 expressed in HEK293 cells co-transfected with rat CaV2.2 channel assessed as reduction in CaV2.2-mediated peak-curr...
Ligand InfoKEGGPC cidPC sid
In DepthDetails ArticlePubMed