BDBM50550658 CHEMBL4792191
SMILES Oc1ccc2Sc3c(Cc2c1)cccc3-c1cc(=O)cc(o1)N1CCOCC1
InChI Key InChIKey=GIFQPYLTHILYRR-UHFFFAOYSA-N
Data  2 IC50
  Tab Delimited (TSV)   2D SDfile   Computed 3D by Vconf -m prep SDfile
Find this compound or compounds like it in BindingDB:
Activity Spreadsheet -- Enzyme Inhibition Constant Data from BindingDB
Found 2 hits for monomerid = 50550658
TargetSerine-protein kinase ATM(Homo sapiens (Human))
Chdi Management/Chdi Foundation
Curated by ChEMBL
LigandPNGBDBM50550658(CHEMBL4792191)
Affinity DataIC50:  0.5nM. Assay description: Inhibition of recombinant full-length human FLAG-tagged ATM assessed as reduction in p53 S15 phosphorylation incubated for 30 mins by ELISA
Ligand InfoPC cidPC sid
In DepthDetails ArticlePubMed
TargetSerine-protein kinase ATM(Homo sapiens (Human))
Chdi Management/Chdi Foundation
Curated by ChEMBL
LigandPNGBDBM50550658(CHEMBL4792191)
Affinity DataIC50:  2.20E+3nM. Assay description: Inhibition of ATM in human MCF7 cells assessed as reduction in etoposide-stimulated KAP1 phosphorylation incubated for 1 hr by ICW assay
Ligand InfoPC cidPC sid
In DepthDetails ArticlePubMed