BDBM50552020 CHEMBL4777424
SMILES NC(=O)N1N=C(CC1c1cn(Cc2ccc(OCCN3CCCCCC3)cc2)c2ccc(Br)cc12)c1ccc(cc1)C(F)(F)F
InChI Key InChIKey=ZTVCCTBSOVIZBK-UHFFFAOYSA-N
Data  2 Kd
  Tab Delimited (TSV)   2D SDfile   Computed 3D by Vconf -m prep SDfile
Find this compound or compounds like it in BindingDB:
Activity Spreadsheet -- Enzyme Inhibition Constant Data from BindingDB
Found 2 hits for monomerid = 50552020
TargetInterleukin-6 receptor subunit beta(Homo sapiens (Human))
China Pharmaceutical University
Curated by ChEMBL
LigandPNGBDBM50552020(CHEMBL4777424)
Affinity DataKd:  3.80E+3nM. Assay description: Binding affinity to immobilized GP130 (unknown origin) by SPR analysis
Ligand InfoPC cidPC sid
In DepthDetails ArticlePubMed
TargetEstrogen receptor(Homo sapiens (Human))
China Pharmaceutical University
Curated by ChEMBL
LigandPNGBDBM50552020(CHEMBL4777424)
Affinity DataKd:  4.72E+4nM. Assay description: Binding affinity to ERalpha (unknown origin) by SPR assay
Ligand InfoPC cidPC sid
In DepthDetails ArticlePubMed