BDBM50552673 CHEMBL4750900
SMILES CC(C)(C)[C@H](NC(=O)[C@H](CCONC(N)=N)NC(=O)Cc1ccc(CN)cc1)C(=O)N[C@@H](CCONC(N)=N)C(=O)NCc1ccc(cc1)C(N)=N
InChI Key InChIKey=QXQQPTQVCYRYNF-KYPHJKQUSA-N
Data  1 KI
  Tab Delimited (TSV)   2D SDfile   Computed 3D by Vconf -m prep SDfile
Find this compound or compounds like it in BindingDB:
Activity Spreadsheet -- Enzyme Inhibition Constant Data from BindingDB
Found 1 hit for monomerid = 50552673
TargetFurin(Homo sapiens (Human))
Philipps University
Curated by ChEMBL
LigandPNGBDBM50552673(CHEMBL4750900)
Affinity DataKi:  0.0340nM. Assay description: Inhibition of recombinant soluble human furin using Phac-Arg-Val-Arg-Arg-AMC fluorogenic substrate
Ligand InfoPC cidPC sid
In DepthDetails ArticlePubMed