BDBM50552675 CHEMBL4747919
SMILES CC(C)(C)[C@H](NC(=O)[C@H](CCONC(N)=N)NC(=O)Cc1ccc(CN)cc1)C(=O)N[C@@H](CCCCN)C(=O)NCc1ccc(cc1)C(N)=N
InChI Key InChIKey=AVASYHYWDXXRFD-UNCTUWKVSA-N
Data  1 KI
  Tab Delimited (TSV)   2D SDfile   Computed 3D by Vconf -m prep SDfile
Find this compound or compounds like it in BindingDB:
Activity Spreadsheet -- Enzyme Inhibition Constant Data from BindingDB
Found 1 hit for monomerid = 50552675
TargetFurin(Homo sapiens (Human))
Philipps University
Curated by ChEMBL
LigandPNGBDBM50552675(CHEMBL4747919)
Affinity DataKi:  0.114nM. Assay description: Inhibition of recombinant soluble human furin using Phac-Arg-Val-Arg-Arg-AMC fluorogenic substrate
Ligand InfoPC cidPC sid
In DepthDetails ArticlePubMed