BDBM50553185 CHEMBL4742903
SMILES FC(F)Cn1c(Cc2ccc(Cl)cc2Cl)cn(Cc2nc3nc(Cl)ccc3[nH]2)c1=O
InChI Key InChIKey=DSIRUKGDOYEIKH-UHFFFAOYSA-N
Data  1 EC50
  Tab Delimited (TSV)   2D SDfile   Computed 3D by Vconf -m prep SDfile
Find this compound or compounds like it in BindingDB:
Activity Spreadsheet -- Enzyme Inhibition Constant Data from BindingDB
Found 1 hit for monomerid = 50553185
TargetMethionine--tRNA ligase, mitochondrial(Homo sapiens)
University Of Washington
Curated by ChEMBL
LigandPNGBDBM50553185(CHEMBL4742903)
Affinity DataEC50:  430nM. Assay description: Inhibition of mitochondrial MetRS-mediated mitochondrial protein synthesis in human HepG2 cells measured after 6 days by ELISA
Ligand InfoPC cidPC sid
In DepthDetails ArticlePubMed