BDBM50553260 CHEMBL4748063
SMILES Brc1cccc(c1)-c1cc([nH]n1)-c1ccc2OCOc2c1
InChI Key InChIKey=RCQIIBJSUWYYFU-UHFFFAOYSA-N
Data  2 Kd
  Tab Delimited (TSV)   2D SDfile   Computed 3D by Vconf -m prep SDfile
Find this compound or compounds like it in BindingDB:
Activity Spreadsheet -- Enzyme Inhibition Constant Data from BindingDB
Found 2 hits for monomerid = 50553260
TargetAlpha-synuclein(Homo sapiens (Human))TBA
LigandPNGBDBM50553260(CHEMBL4748063)
Affinity DataKd:  1.90E+5nM. Assay description: Binding affinity to C-terminal His6-tagged human Alpha-synuclein fibrils (1 to 97 residues) expressed in Escherichia coli assessed as dissociation co...
In DepthDetails PubMed
TargetAlpha-synuclein(Homo sapiens (Human))TBA
LigandPNGBDBM50553260(CHEMBL4748063)
Affinity DataKd:  190nM. Assay description: Binding affinity to alpha-synuclein (unknown origin) expressed in Escherichia coli BL21(DE3) pLysS by fluorescence method
In DepthDetails ArticlePubMed