BDBM50553289 CHEMBL4763318
SMILES CCC\N=C1/S\C(=C/c2ccc(O)c(Cl)c2)C(=O)N1C1CCOCC1
InChI Key InChIKey=CVUOUVVVXQNIRL-JTHVCAJSSA-N
Data  1 IC50
  Tab Delimited (TSV)   2D SDfile   Computed 3D by Vconf -m prep SDfile
Find this compound or compounds like it in BindingDB:
Activity Spreadsheet -- Enzyme Inhibition Constant Data from BindingDB
Found 1 hit for monomerid = 50553289
TargetSphingosine 1-phosphate receptor 1(Homo sapiens (Human))
University Of Dundee
Curated by ChEMBL
LigandPNGBDBM50553289(CHEMBL4763318)
Affinity DataIC50:  40nM. Assay description: Immunomodulatory activity at human S1PR1 expressed in CHO-K1 EDG1 beta-arrestin cells assessed as stimulation of beta-arrestin recruitment incubated ...
Ligand InfoPC cidPC sid
In DepthDetails ArticlePubMed