BDBM50553297 CHEMBL4747234
SMILES Cc1ccccc1N1C(=O)\C(S\C1=N/CCCF)=C\c1ccc(O)c(Cl)c1
InChI Key InChIKey=AZSOWDIRECVSDI-AWDJCAROSA-N
Data  1 IC50
  Tab Delimited (TSV)   2D SDfile   Computed 3D by Vconf -m prep SDfile
Find this compound or compounds like it in BindingDB:
Activity Spreadsheet -- Enzyme Inhibition Constant Data from BindingDB
Found 1 hit for monomerid = 50553297
TargetSphingosine 1-phosphate receptor 1(Homo sapiens (Human))
University Of Dundee
Curated by ChEMBL
LigandPNGBDBM50553297(CHEMBL4747234)
Affinity DataIC50:  25nM. Assay description: Immunomodulatory activity at human S1PR1 expressed in CHO-K1 EDG1 beta-arrestin cells assessed as stimulation of beta-arrestin recruitment incubated ...
Ligand InfoPC cidPC sid
In DepthDetails ArticlePubMed