BDBM50553740 CHEMBL4776208
SMILES Cc1nc2cc(Nc3cc4n(CC5CC5)cnc4cn3)ccc2o1
InChI Key InChIKey=YJVUAYVRDJQBCX-UHFFFAOYSA-N
Data  1 KI
  Tab Delimited (TSV)   2D SDfile   Computed 3D by Vconf -m prep SDfile
Find this compound or compounds like it in BindingDB:
Activity Spreadsheet -- Enzyme Inhibition Constant Data from BindingDB
Found 1 hit for monomerid = 50553740
TargetGABA-A receptor; alpha-5/beta-3/gamma-2(Homo sapiens (Human))
Charles River Discovery Research Services
Curated by ChEMBL
LigandPNGBDBM50553740(CHEMBL4776208)
Affinity DataKi:  85nM. Assay description: Displacement of [3H]-Ro15-1788 from human GABAA alpha5beta3gamma2 by scintillation proximity assay
Ligand InfoPC cidPC sid
In DepthDetails ArticlePubMed