BDBM50553744 CHEMBL4741416
SMILES Cn1c2ccc(Nc3cc4n(CC5CC5)cnc4cn3)cc2oc1=O
InChI Key InChIKey=HABHWSCJBONLHD-UHFFFAOYSA-N
Data  1 KI
  Tab Delimited (TSV)   2D SDfile   Computed 3D by Vconf -m prep SDfile
Find this compound or compounds like it in BindingDB:
Activity Spreadsheet -- Enzyme Inhibition Constant Data from BindingDB
Found 1 hit for monomerid = 50553744
TargetGABA-A receptor; alpha-5/beta-3/gamma-2(Homo sapiens (Human))
Charles River Discovery Research Services
Curated by ChEMBL
LigandPNGBDBM50553744(CHEMBL4741416)
Affinity DataKi:  62nM. Assay description: Displacement of [3H]-Ro15-1788 from human GABAA alpha5beta3gamma2 by scintillation proximity assay
Ligand InfoPC cidPC sid
In DepthDetails ArticlePubMed