BDBM50553762 CHEMBL4758608
SMILES Cc1cc(Nc2ccc(cn2)-c2cnc3ncccn23)nc2n(CC3CC3)cnc12
InChI Key InChIKey=VQQCPWHLJXFLOG-UHFFFAOYSA-N
Data  1 KI
  Tab Delimited (TSV)   2D SDfile   Computed 3D by Vconf -m prep SDfile
Find this compound or compounds like it in BindingDB:
Activity Spreadsheet -- Enzyme Inhibition Constant Data from BindingDB
Found 1 hit for monomerid = 50553762
TargetGABA-A receptor; alpha-5/beta-3/gamma-2(Homo sapiens (Human))
Charles River Discovery Research Services
Curated by ChEMBL
LigandPNGBDBM50553762(CHEMBL4758608)
Affinity DataKi:  1nM. Assay description: Displacement of [3H]-Ro15-1788 from human GABAA alpha5beta3gamma2 by scintillation proximity assay
Ligand InfoPC cidPC sid
In DepthDetails ArticlePubMed