BDBM50555330 CHEMBL4777688::US11306078, Example 1.187c
SMILES C[C@H](NC(=O)[C@H]1CN(CC[C@@H]1NC(=O)c1cc(on1)-c1ccc(F)cc1F)C1CCCCC1)c1ccccn1
InChI Key InChIKey=MXCWYLRFOQOZOR-PZGSVQSZSA-N
Data  2 IC50
  Tab Delimited (TSV)   2D SDfile   Computed 3D by Vconf -m prep SDfile
Find this compound or compounds like it in BindingDB:
Activity Spreadsheet -- Enzyme Inhibition Constant Data from BindingDB
Found 2 hits for monomerid = 50555330
TargetAtypical chemokine receptor 3(Homo sapiens (Human))
Idorsia Pharmaceuticals
US Patent
LigandPNGBDBM50555330(CHEMBL4777688 | US11306078, Example 1.187c)
Affinity DataIC50:  3nM. Assay description: Tango CXCR7-bla U2OS cells are detached from culture dishes with 0.05% trypsin-EDTA and collected in growing medium (McCoy's 5A 90% (v/v), dialyz...
Ligand InfoPC cidPC sid
In DepthDetails US Patent
TargetAtypical chemokine receptor 3(Homo sapiens (Human))
Idorsia Pharmaceuticals
US Patent
LigandPNGBDBM50555330(CHEMBL4777688 | US11306078, Example 1.187c)
Affinity DataIC50:  981nM. Assay description: Antagonist activity at CXCR7 (unknown origin) expressed in human U2OS cells co-expressing beta-arrestin assessed as reduction in CXCL12-alpha induced...
Ligand InfoPC cidPC sid
In DepthDetails ArticlePubMed