BDBM50556692 CHEMBL4789452
SMILES COc1ccc(cc1)-c1noc(CC(=O)NCCCCN)c1-c1ccc(OC)cc1
InChI Key InChIKey=XONRBNVUBLFDEI-UHFFFAOYSA-N
Data  2 IC50
  Tab Delimited (TSV)   2D SDfile   Computed 3D by Vconf -m prep SDfile
Find this compound or compounds like it in BindingDB:
Activity Spreadsheet -- Enzyme Inhibition Constant Data from BindingDB
Found 2 hits for monomerid = 50556692
TargetProstaglandin G/H synthase 2(Homo sapiens (Human))
University Of Bari "Aldo Moro
Curated by ChEMBL
LigandPNGBDBM50556692(CHEMBL4789452)
Affinity DataIC50:  3.50E+3nM. Assay description: Inhibition of human COX-2 assessed as peroxidase activity using arachidonic acid as substrate by colorimetric method
Ligand InfoPC cidPC sid
In DepthDetails ArticlePubMed
TargetProstaglandin G/H synthase 1(Ovis aries (Sheep))
University Of Bari "Aldo Moro
Curated by ChEMBL
LigandPNGBDBM50556692(CHEMBL4789452)
Affinity DataIC50:  950nM. Assay description: Inhibition of ovine COX-1 assessed as peroxidase activity using arachidonic acid as substrate by colorimetric method
Ligand InfoPC cidPC sid
In DepthDetails ArticlePubMed