BDBM50558345 CHEMBL4788843
SMILES COc1ccc(CN2C3CCC2CC(C3)NC(=O)c2ccc3ccccc3c2)cc1
InChI Key InChIKey=WRTDTGCYNXJBFL-UHFFFAOYSA-N
Data  3 KI
  Tab Delimited (TSV)   2D SDfile   Computed 3D by Vconf -m prep SDfile
Find this compound or compounds like it in BindingDB:
Activity Spreadsheet -- Enzyme Inhibition Constant Data from BindingDB
Found 3 hits for monomerid = 50558345
TargetD(2) dopamine receptor(Rattus norvegicus (rat))
Medical University Of Warsaw
Curated by ChEMBL
LigandPNGBDBM50558345(CHEMBL4788843)
Affinity DataKi:  0.600nM. Assay description: Displacement of [3H] Spiperone from rat striatum dopamine D2 receptor measured after 30 mins by liquid scintillation counter method
Ligand InfoPC cidPC sid
In DepthDetails ArticlePubMed
Target5-hydroxytryptamine receptor 2A(Rattus norvegicus (rat))
Medical University Of Warsaw
Curated by ChEMBL
LigandPNGBDBM50558345(CHEMBL4788843)
Affinity DataKi:  920nM. Assay description: Displacement of [3H]-ketanserin from rat cerebral cortex 5HT2A receptor measured after 20 mins by liquid scintillation counter method
Ligand InfoPC cidPC sid
In DepthDetails ArticlePubMed
Target5-hydroxytryptamine receptor 1A(Rattus norvegicus (rat))
Medical University Of Warsaw
Curated by ChEMBL
LigandPNGBDBM50558345(CHEMBL4788843)
Affinity DataKi:  2.60E+3nM. Assay description: Displacement of [3H]-8-OH-DPAT from rat cerebral cortex 5HT1A receptor measured after 15 mins by liquid scintillation counter method
Ligand InfoPC cidPC sid
In DepthDetails ArticlePubMed