BDBM50558365 CHEMBL4756827
SMILES CCCCCCCCCCCCCCC[C@@H](O)[C@H](COP(O)(O)=O)N=[N+]=[N-]
InChI Key InChIKey=NNDHCRGVTNXNJW-ZWKOTPCHSA-N
Data  1 KI  1 IC50
  Tab Delimited (TSV)   2D SDfile   Computed 3D by Vconf -m prep SDfile
Find this compound or compounds like it in BindingDB:
Activity Spreadsheet -- Enzyme Inhibition Constant Data from BindingDB
Found 2 hits for monomerid = 50558365
TargetSphingosine-1-phosphate lyase 1(Homo sapiens (Human))
Spanish National Research Council (Csic)
Curated by ChEMBL
LigandPNGBDBM50558365(CHEMBL4756827)
Affinity DataKi:  1.90E+4nM. Assay description: Competitive inhibition of human S1PL using varying levels of RBM13 as substrate by Lineweaver-Burk plot analysis
Ligand InfoPC cidPC sid
In DepthDetails ArticlePubMed
TargetSphingosine-1-phosphate lyase 1(Homo sapiens (Human))
Spanish National Research Council (Csic)
Curated by ChEMBL
LigandPNGBDBM50558365(CHEMBL4756827)
Affinity DataIC50:  2.57E+4nM. Assay description: Inhibition of recombinant human S1PL using RBM13 as fluorogenic substrate incubated for 1 hr
Ligand InfoPC cidPC sid
In DepthDetails ArticlePubMed