BDBM50558631 CHEMBL4764600
SMILES COc1ccc(cc1OC)-c1cc(n2nc(cc2n1)C1CC1)C(F)(F)F
InChI Key InChIKey=CRQXGMVEWZKZPV-UHFFFAOYSA-N
Data  1 IC50
  Tab Delimited (TSV)   2D SDfile   Computed 3D by Vconf -m prep SDfile
Find this compound or compounds like it in BindingDB:
Activity Spreadsheet -- Enzyme Inhibition Constant Data from BindingDB
Found 1 hit for monomerid = 50558631
TargetFar upstream element-binding protein 1(Homo sapiens)
Institute For Tumor Biology And Experimental Therapy
Curated by ChEMBL
LigandPNGBDBM50558631(CHEMBL4764600)
Affinity DataIC50:  1.03E+5nM. Assay description: Inhibition of 6xHis-tagged human FUBP1 expressed in HEK293T cells assessed as reduction in FUBP1 interaction with biotinylated NLC chip immobilized F...
Ligand InfoPC cidPC sid
In DepthDetails ArticlePubMed