BDBM50558854 CHEMBL4755711
SMILES [H][C@]1(NC(=O)[C@](C)(CCC\C=C\CCC[C@](C)(NC(=O)[C@H](CC(O)=O)NC(=O)CNC1=O)C(=O)N[C@@H](Cc1ccccc1)C(=O)N[C@@H](CC(N)=O)C(=O)N[C@@H](C)C(=O)N[C@@H](Cc1ccc(O)cc1)C(=O)N[C@@H](Cc1ccc(O)cc1)C(=O)N[C@@H](C)C(=O)N[C@@H](CCCNC(N)=N)C(=O)N[C@@H](CCCNC(N)=N)C(N)=O)NC(=O)[C@H](CCCNC(N)=N)NC(=O)[C@H](CC(C)C)NC(=O)[C@H](CCC(O)=O)NC(=O)[C@H](CCC(N)=O)NC(=O)[C@H](C)NC(=O)[C@@H](NC(=O)C(CNC(=O)C=C)NC(=O)[C@@H](NC(C)=O)[C@@H](C)CC)[C@@H](C)CC)[C@@H](C)CC
InChI Key InChIKey=MWULFOCTLISUDK-PRJISGMBSA-N
Data  1 KI  2 IC50
  Tab Delimited (TSV)   2D SDfile   Computed 3D by Vconf -m prep SDfile
Find this compound or compounds like it in BindingDB:
Activity Spreadsheet -- Enzyme Inhibition Constant Data from BindingDB
Found 3 hits for monomerid = 50558854
TargetBcl-2-related protein A1(Homo sapiens (Human))
The University Of Queensland
Curated by ChEMBL
LigandPNGBDBM50558854(CHEMBL4755711)
Affinity DataKi:  82nM. Assay description: Covalent binding affinity to human Bcl2A1 by FBid based FP assay
Ligand InfoPC cidPC sid
In DepthDetails ArticlePubMed
TargetBcl-2-related protein A1(Homo sapiens (Human))
The University Of Queensland
Curated by ChEMBL
LigandPNGBDBM50558854(CHEMBL4755711)
Affinity DataIC50:  14nM. Assay description: Binding affinity to human Bcl2A1 incubated for 2 hrs by FBid based competitive FP assay
Ligand InfoPC cidPC sid
In DepthDetails ArticlePubMed
TargetInduced myeloid leukemia cell differentiation protein Mcl-1(Homo sapiens (Human))
The University Of Queensland
Curated by ChEMBL
LigandPNGBDBM50558854(CHEMBL4755711)
Affinity DataIC50:  35nM. Assay description: Binding affinity to human Mcl1 incubated for 2 hrs by FBid based competitive FP assay
Ligand InfoPC cidPC sid
In DepthDetails ArticlePubMed