BDBM50559060 CHEMBL4786787
SMILES CN1CCN(CC1)c1ccc(Nc2ncc3nc(Nc4ccccc4)n([C@@H]4CCN(C4)S(=O)(=O)C4CC4)c3n2)cc1
InChI Key InChIKey=RNEHWYIFHKBZAW-XMMPIXPASA-N
Data  2 IC50
  Tab Delimited (TSV)   2D SDfile   Computed 3D by Vconf -m prep SDfile
Find this compound or compounds like it in BindingDB:
Activity Spreadsheet -- Enzyme Inhibition Constant Data from BindingDB
Found 2 hits for monomerid = 50559060
TargetEpidermal growth factor receptor(Homo sapiens (Human))
H. R. Patel Institute Of Pharmaceutical Education And Research
Curated by ChEMBL
LigandPNGBDBM50559060(CHEMBL4786787)
Affinity DataIC50:  40nM. Assay description: Inhibition of EGFR L858R/T790M/C797S triple mutant (unknown origin)
In DepthDetails PubMed
TargetEpidermal growth factor receptor(Homo sapiens (Human))
H. R. Patel Institute Of Pharmaceutical Education And Research
Curated by ChEMBL
LigandPNGBDBM50559060(CHEMBL4786787)
Affinity DataIC50:  18nM. Assay description: Inhibition of EGFR L858R/T790M/C797S (unknown origin) using Poly (Glu, Tyr) as substrate measured after 40 mins by kinase-glo assay
In DepthDetails ArticlePubMed