BDBM50560643 CHEMBL4749360
SMILES [H][C@]12CN(C(=O)Nc3cnccc3Cl)[C@@]1([H])CN(Cc1cccc(Oc3ccc(Cl)cc3)c1)C2
InChI Key InChIKey=KZLTXXPHAJNLBB-SBUREZEXSA-N
Data  2 IC50
  Tab Delimited (TSV)   2D SDfile   Computed 3D by Vconf -m prep SDfile
Find this compound or compounds like it in BindingDB:
Activity Spreadsheet -- Enzyme Inhibition Constant Data from BindingDB
Found 2 hits for monomerid = 50560643
TargetFatty-acid amide hydrolase 1 [30-579](Rattus norvegicus (rat))
Janssen Pharmaceutical Companies Of Johnson & Johnson
Curated by ChEMBL
LigandPNGBDBM50560643(CHEMBL4749360)
Affinity DataIC50:  139nM. Assay description: Inhibition of rat FAAH1 incubated for 60 mins
Ligand InfoPC cidPC sid
In DepthDetails ArticlePubMed
TargetFatty-acid amide hydrolase 1(Homo sapiens (Human))
Janssen Pharmaceutical Companies Of Johnson & Johnson
Curated by ChEMBL
LigandPNGBDBM50560643(CHEMBL4749360)
Affinity DataIC50:  3.67E+3nM. Assay description: Inhibition of human FAAH1 incubated for 60 mins
Ligand InfoPC cidPC sid
In DepthDetails ArticlePubMed