BDBM50560649 CHEMBL4791417
SMILES [H][C@@]12CN(Cc3cccc(Oc4cc(Cl)cc(Cl)c4)c3)C[C@]1([H])CN(C2)C(=O)Nc1noc2ccccc12
InChI Key InChIKey=AJLIZRPXUITHRW-KDURUIRLSA-N
Data  2 IC50
  Tab Delimited (TSV)   2D SDfile   Computed 3D by Vconf -m prep SDfile
Find this compound or compounds like it in BindingDB:
Activity Spreadsheet -- Enzyme Inhibition Constant Data from BindingDB
Found 2 hits for monomerid = 50560649
TargetFatty-acid amide hydrolase 1 [30-579](Rattus norvegicus (rat))
Janssen Pharmaceutical Companies Of Johnson & Johnson
Curated by ChEMBL
LigandPNGBDBM50560649(CHEMBL4791417)
Affinity DataIC50:  403nM. Assay description: Inhibition of rat FAAH1 incubated for 60 mins
Ligand InfoPC cidPC sid
In DepthDetails ArticlePubMed
TargetFatty-acid amide hydrolase 1(Homo sapiens (Human))
Janssen Pharmaceutical Companies Of Johnson & Johnson
Curated by ChEMBL
LigandPNGBDBM50560649(CHEMBL4791417)
Affinity DataIC50: >1.00E+4nM. Assay description: Inhibition of human FAAH1 incubated for 60 mins
Ligand InfoPC cidPC sid
In DepthDetails ArticlePubMed