BDBM50560719 CHEMBL4755696
SMILES CC(C)N1[C@H](C)C(=O)N(C)c2ccc(Nc3nccc(n3)-c3cccc(N)c3)cc12
InChI Key InChIKey=IVGGZYPSQXBUGB-OAHLLOKOSA-N
Data  2 IC50
  Tab Delimited (TSV)   2D SDfile   Computed 3D by Vconf -m prep SDfile
Find this compound or compounds like it in BindingDB:
Activity Spreadsheet -- Enzyme Inhibition Constant Data from BindingDB
Found 2 hits for monomerid = 50560719
TargetCyclin-dependent kinase 9(Homo sapiens (Human))
Chinese Academy Of Sciences
Curated by ChEMBL
LigandPNGBDBM50560719(CHEMBL4755696)
Affinity DataIC50:  5.90nM. Assay description: Inhibition of human CDK9 by mobility shift assay relative to control
Ligand InfoPC cidPC sid
In DepthDetails ArticlePubMed
TargetBromodomain-containing protein 4(Homo sapiens (Human))
Chinese Academy Of Sciences
Curated by ChEMBL
LigandPNGBDBM50560719(CHEMBL4755696)
Affinity DataIC50:  120nM. Assay description: Inhibition of His6-tagged BRD4 bromodomain 1 (unknown origin) expressed in Escherichia coli Bl21(DE3) cells incubated for 4 hrs by FP assay
Ligand InfoPC cidPC sid
In DepthDetails ArticlePubMed