BDBM50560793 CHEMBL4788945
SMILES Nc1nccc(COc2ccc3nc(NC4CCCCC4)sc3c2)c1Cl
InChI Key InChIKey=ZXYVWKYLUPYZGL-UHFFFAOYSA-N
Data  2 IC50  5 Kd
  Tab Delimited (TSV)   2D SDfile   Computed 3D by Vconf -m prep SDfile
Find this compound or compounds like it in BindingDB:
Activity Spreadsheet -- Enzyme Inhibition Constant Data from BindingDB
Found 7 hits for monomerid = 50560793
TargetMacrophage colony-stimulating factor 1 receptor(Homo sapiens (Human))
University Of Texas Md Anderson Cancer Center
Curated by ChEMBL
LigandPNGBDBM50560793(CHEMBL4788945)
Affinity DataIC50:  4nM. Assay description: Inhibition of AlexaFluor-labeled tracer 236 binding to recombinant human His-tagged CSF1R (538 to 910 residues) preincubated for 20 mins followed by ...
Ligand InfoPC cidPC sid
In DepthDetails ArticlePubMed
TargetMacrophage colony-stimulating factor 1 receptor(Homo sapiens (Human))
University Of Texas Md Anderson Cancer Center
Curated by ChEMBL
LigandPNGBDBM50560793(CHEMBL4788945)
Affinity DataKd:  2.5nM. Assay description: Binding affinity to human wild type CSF1R (I564 to S939 residues) expressed in bacterial expression system by kinome scan assay
Ligand InfoPC cidPC sid
In DepthDetails ArticlePubMed
TargetReceptor-type tyrosine-protein kinase FLT3(Homo sapiens (Human))
University Of Texas Md Anderson Cancer Center
Curated by ChEMBL
LigandPNGBDBM50560793(CHEMBL4788945)
Affinity DataKd:  170nM. Assay description: Binding affinity to human wild type FLT3 (V592 to Y969 residues) expressed in bacterial expression system by kinome scan assay
Ligand InfoPC cidPC sid
In DepthDetails ArticlePubMed
TargetMacrophage colony-stimulating factor 1 receptor(Mus musculus (Mouse))
University Of Texas Md Anderson Cancer Center
Curated by ChEMBL
LigandPNGBDBM50560793(CHEMBL4788945)
Affinity DataIC50:  228nM. Assay description: Inhibition of CSF1R in mouse NFS-60 cells assessed as reduction in CSF-induced cell proliferation after 72 hrs by CellTiter-Glo assay
Ligand InfoPC cidPC sid
In DepthDetails ArticlePubMed
TargetPlatelet-derived growth factor receptor beta(Homo sapiens (Human))
University Of Texas Md Anderson Cancer Center
Curated by ChEMBL
LigandPNGBDBM50560793(CHEMBL4788945)
Affinity DataKd:  3.80nM. Assay description: Binding affinity to human wild type PDGFRbeta (V582 to Y1009 residues) expressed in bacterial expression system by kinome scan assay
Ligand InfoPC cidPC sid
In DepthDetails ArticlePubMed
TargetPlatelet-derived growth factor receptor alpha(Homo sapiens (Human))
University Of Texas Md Anderson Cancer Center
Curated by ChEMBL
LigandPNGBDBM50560793(CHEMBL4788945)
Affinity DataKd:  46nM. Assay description: Binding affinity to human wild type PDGFRalpha (V575 to D1002 residues) expressed in mammalian expression system by kinome scan assay
Ligand InfoPC cidPC sid
In DepthDetails ArticlePubMed
TargetMast/stem cell growth factor receptor Kit(Homo sapiens (Human))
University Of Texas Md Anderson Cancer Center
Curated by ChEMBL
LigandPNGBDBM50560793(CHEMBL4788945)
Affinity DataKd:  79nM. Assay description: Binding affinity to c-Kit (unknown origin) by kinome scan assay
Ligand InfoPC cidPC sid
In DepthDetails ArticlePubMed