BDBM50560886 CHEMBL4744403
SMILES CC(C)c1ccn2ncnc(N[C@H]3CC[C@H](CC3)N3CCN(CC3)C(C)=O)c12
InChI Key InChIKey=FQBRQRVXPUQKLG-HDICACEKSA-N
Data  5 IC50
  Tab Delimited (TSV)   2D SDfile   Computed 3D by Vconf -m prep SDfile
Find this compound or compounds like it in BindingDB:
Activity Spreadsheet -- Enzyme Inhibition Constant Data from BindingDB
Found 5 hits for monomerid = 50560886
TargetInterleukin-1 receptor-associated kinase 1(Homo sapiens (Human))
Astrazeneca
Curated by ChEMBL
LigandPNGBDBM50560886(CHEMBL4744403)
Affinity DataIC50:  1.30E+3nM. Assay description: Inhibition of recombinant human N-terminal GST-tagged IRAK1 (194 to 712 residues) expressed in baculovirus expression system using 5-FAM-KKKVSRSGLYRS...
Ligand InfoPC cidPC sid
In DepthDetails ArticlePubMed
TargetInterleukin-1 receptor-associated kinase 3(Homo sapiens (Human))
Astrazeneca
Curated by ChEMBL
LigandPNGBDBM50560886(CHEMBL4744403)
Affinity DataIC50:  6nM. Assay description: Inhibition of kinase tracer 236 binding to recombinant human full-length GST-tagged IRAK3 expressed in insect cells by Lanthascreen Eu kinase binding...
Ligand InfoPC cidPC sid
In DepthDetails ArticlePubMed
TargetCyclin-C/Cyclin-dependent kinase 19(Homo sapiens (Human))
Astrazeneca
Curated by ChEMBL
LigandPNGBDBM50560886(CHEMBL4744403)
Affinity DataIC50:  70nM. Assay description: Inhibition of CDK11/cyclin C (unknown origin)
Ligand InfoPC cidPC sid
In DepthDetails ArticlePubMed
TargetSerine/threonine-protein kinase haspin(Homo sapiens (Human))
Astrazeneca
Curated by ChEMBL
LigandPNGBDBM50560886(CHEMBL4744403)
Affinity DataIC50:  150nM. Assay description: Inhibition of GSG2 (unknown origin)
Ligand InfoPC cidPC sid
In DepthDetails ArticlePubMed
TargetInterleukin-1 receptor-associated kinase 4(Homo sapiens (Human))
Astrazeneca
Curated by ChEMBL
LigandPNGBDBM50560886(CHEMBL4744403)
Affinity DataIC50: >1.00E+3nM. Assay description: Inhibition of recombinant human full-length His-tagged IRAK4 expressed in baculovirus expression system using 5-FAM-IPTSPITTTYFFFKKK-COOH as substrat...
Ligand InfoPC cidPC sid
In DepthDetails ArticlePubMed