BDBM50560904 CHEMBL4791281
SMILES CC(C)c1ccn2ncnc(N[C@H]3CC[C@H](CC3)N3CCN(CC3)C(=O)CCC(=O)NCCCCNc3cccc4C(=O)N(C5CCC(=O)NC5=O)C(=O)c34)c12
InChI Key InChIKey=KVMSGNPTEGWHND-DANFTSOSSA-N
Data  2 IC50
  Tab Delimited (TSV)   2D SDfile   Computed 3D by Vconf -m prep SDfile
Find this compound or compounds like it in BindingDB:
Activity Spreadsheet -- Enzyme Inhibition Constant Data from BindingDB
Found 2 hits for monomerid = 50560904
TargetInterleukin-1 receptor-associated kinase 4(Homo sapiens (Human))
Astrazeneca
Curated by ChEMBL
LigandPNGBDBM50560904(CHEMBL4791281)
Affinity DataIC50: >1.00E+3nM. Assay description: Inhibition of recombinant human full-length His-tagged IRAK4 expressed in baculovirus expression system using 5-FAM-IPTSPITTTYFFFKKK-COOH as substrat...
Ligand InfoPC cidPC sid
In DepthDetails ArticlePubMed
TargetInterleukin-1 receptor-associated kinase 3(Homo sapiens (Human))
Astrazeneca
Curated by ChEMBL
LigandPNGBDBM50560904(CHEMBL4791281)
Affinity DataIC50:  13nM. Assay description: Inhibition of kinase tracer 236 binding to recombinant human full-length GST-tagged IRAK3 expressed in insect cells by Lanthascreen Eu kinase binding...
Ligand InfoPC cidPC sid
In DepthDetails ArticlePubMed