BDBM50561194 CHEMBL4790324
SMILES CN1CCN(Cc2ccc(cc2)-c2cccc(c2)C(=O)Nc2ccccc2CC(O)=O)CC1
InChI Key InChIKey=UTWXDNZWMQAUKL-UHFFFAOYSA-N
Data  1 IC50
PDB links: 1 PDB ID matches this monomer.
  Tab Delimited (TSV)   2D SDfile   Computed 3D by Vconf -m prep SDfile
Find this compound or compounds like it in BindingDB:
Activity Spreadsheet -- Enzyme Inhibition Constant Data from BindingDB
Found 1 hit for monomerid = 50561194
TargetSuccinate receptor 1(Homo sapiens (Human))
Novartis Institutes For Biomedical Research
Curated by ChEMBL
LigandPNGBDBM50561194(CHEMBL4790324)
Affinity DataIC50:  25nM. Assay description: Antagonist activity at human SUCNR1 expressed in human CHEM1 cells incubated for 60 mins in presence of [35S]GTPgammaS by scintillation proximity ass...
In DepthDetails ArticlePubMed