BDBM50561195 CHEMBL4743401
SMILES NCc1cc(ccc1Cl)-c1cccc(c1)C(=O)Nc1ccccc1CC(O)=O
InChI Key InChIKey=ZFAJPOLKQKSTMN-UHFFFAOYSA-N
Data  3 IC50
  Tab Delimited (TSV)   2D SDfile   Computed 3D by Vconf -m prep SDfile
Find this compound or compounds like it in BindingDB:
Activity Spreadsheet -- Enzyme Inhibition Constant Data from BindingDB
Found 3 hits for monomerid = 50561195
TargetSuccinate receptor 1(Homo sapiens (Human))
Novartis Institutes For Biomedical Research
Curated by ChEMBL
LigandPNGBDBM50561195(CHEMBL4743401)
Affinity DataIC50:  300nM. Assay description: Antagonist activity at human SUCNR1 expressed in human CHEM1 cells incubated for 60 mins in presence of [35S]GTPgammaS by scintillation proximity ass...
Ligand InfoPC cidPC sid
In DepthDetails ArticlePubMed
TargetCoagulation factor XI(Homo sapiens (Human))
Novartis Institutes For Biomedical Research
Curated by ChEMBL
LigandPNGBDBM50561195(CHEMBL4743401)
Affinity DataIC50:  5.80E+3nM. Assay description: Inhibition of human factor 11a by TR-FRET assay
Ligand InfoPC cidPC sid
In DepthDetails ArticlePubMed
TargetComplement factor D(Homo sapiens (Human))
Novartis Institutes For Biomedical Research
Curated by ChEMBL
LigandPNGBDBM50561195(CHEMBL4743401)
Affinity DataIC50: >1.00E+5nM. Assay description: Inhibition of recombinant human CFD expressed in Escherichia coli incubated up to 2 hrs by TR-FRET assay
Ligand InfoPC cidPC sid
In DepthDetails ArticlePubMed