BDBM50561196 CHEMBL4781889
SMILES NCCOc1cc(ccc1Cl)-c1cccc(c1)C(=O)Nc1ccccc1CC(O)=O
InChI Key InChIKey=CHNOCYSXOAXIMZ-UHFFFAOYSA-N
Data  1 IC50
  Tab Delimited (TSV)   2D SDfile   Computed 3D by Vconf -m prep SDfile
Find this compound or compounds like it in BindingDB:
Activity Spreadsheet -- Enzyme Inhibition Constant Data from BindingDB
Found 1 hit for monomerid = 50561196
TargetSuccinate receptor 1(Homo sapiens (Human))
Novartis Institutes For Biomedical Research
Curated by ChEMBL
LigandPNGBDBM50561196(CHEMBL4781889)
Affinity DataIC50:  270nM. Assay description: Antagonist activity at human SUCNR1 expressed in human CHEM1 cells incubated for 60 mins in presence of [35S]GTPgammaS by scintillation proximity ass...
Ligand InfoPC cidPC sid
In DepthDetails ArticlePubMed