BDBM50561198 CHEMBL4783334
SMILES OC(=O)Cc1ccccc1NC(=O)c1cccc(c1)-c1ccc(Cl)c(OC2CCNC2)c1
InChI Key InChIKey=KZUHMJVXTGQROA-UHFFFAOYSA-N
Data  1 IC50
  Tab Delimited (TSV)   2D SDfile   Computed 3D by Vconf -m prep SDfile
Find this compound or compounds like it in BindingDB:
Activity Spreadsheet -- Enzyme Inhibition Constant Data from BindingDB
Found 1 hit for monomerid = 50561198
TargetSuccinate receptor 1(Homo sapiens (Human))
Novartis Institutes For Biomedical Research
Curated by ChEMBL
LigandPNGBDBM50561198(CHEMBL4783334)
Affinity DataIC50:  140nM. Assay description: Antagonist activity at human SUCNR1 expressed in human CHEM1 cells incubated for 60 mins in presence of [35S]GTPgammaS by scintillation proximity ass...
Ligand InfoPC cidPC sid
In DepthDetails ArticlePubMed