BDBM50561478 CHEMBL4741953
SMILES CC(C#Cc1cccc(c1)C(=O)NCc1ccccc1OC(F)(F)F)N(O)C(N)=O
InChI Key InChIKey=USPGDVAVCCDZAL-UHFFFAOYSA-N
Data  2 IC50
  Tab Delimited (TSV)   2D SDfile   Computed 3D by Vconf -m prep SDfile
Find this compound or compounds like it in BindingDB:
Activity Spreadsheet -- Enzyme Inhibition Constant Data from BindingDB
Found 2 hits for monomerid = 50561478
TargetPolyunsaturated fatty acid 5-lipoxygenase(Homo sapiens (Human))
Goethe-University Of Frankfurt
Curated by ChEMBL
LigandPNGBDBM50561478(CHEMBL4741953)
Affinity DataIC50:  1.00E+3nM. Assay description: Inhibition of 5-LOX (unknown origin) expressed in Escherichia coli BL21-(DE3) pre-incubated for 15 mins before AA substrate addition and measured aft...
Ligand InfoPC cidPC sid
In DepthDetails ArticlePubMed
TargetBifunctional epoxide hydrolase 2(Homo sapiens (Human))
Goethe-University Of Frankfurt
Curated by ChEMBL
LigandPNGBDBM50561478(CHEMBL4741953)
Affinity DataIC50:  16nM. Assay description: Inhibition of human sEH (1 to 555 residues) expressed in Escherichia coli BL21-(DE3) using PHOME substrate incubated for 30 to 45 mins by fluorescenc...
Ligand InfoPC cidPC sid
In DepthDetails ArticlePubMed