BDBM50561485 CHEMBL4757630
SMILES CC(C#Cc1cccc(c1)C(=O)NCCC(c1ccccc1)c1ccc(OC(F)(F)F)cc1)N(O)C(N)=O
InChI Key InChIKey=HQXPQGGUDYBGKG-UHFFFAOYSA-N
Data  2 IC50
PDB links: 1 PDB ID matches this monomer.
  Tab Delimited (TSV)   2D SDfile   Computed 3D by Vconf -m prep SDfile
Find this compound or compounds like it in BindingDB:
Activity Spreadsheet -- Enzyme Inhibition Constant Data from BindingDB
Found 2 hits for monomerid = 50561485
TargetPolyunsaturated fatty acid 5-lipoxygenase(Homo sapiens (Human))
Goethe-University Of Frankfurt
Curated by ChEMBL
LigandPNGBDBM50561485(CHEMBL4757630)
Affinity DataIC50:  110nM. Assay description: Inhibition of 5-LOX (unknown origin) expressed in Escherichia coli BL21-(DE3) pre-incubated for 15 mins before AA substrate addition and measured aft...
Ligand InfoPC cidPC sidPDB
In DepthDetails ArticlePubMed
TargetBifunctional epoxide hydrolase 2(Homo sapiens (Human))
Goethe-University Of Frankfurt
Curated by ChEMBL
LigandPNGBDBM50561485(CHEMBL4757630)
Affinity DataIC50:  7nM. Assay description: Inhibition of human sEH (1 to 555 residues) expressed in Escherichia coli BL21-(DE3) using PHOME substrate incubated for 30 to 45 mins by fluorescenc...
Ligand InfoPC cidPC sidPDB