BDBM50561618 CHEMBL4746439
SMILES [#7]-[#6@H]1-[#6]=[#6](-[#6]\[#6]-1=[#6](/F)F)-[#6](-[#8])=O
InChI Key InChIKey=FBLNZOCTNRXJQD-YFKPBYRVSA-N
Data  1 KI
  Tab Delimited (TSV)   2D SDfile   Computed 3D by Vconf -m prep SDfile
Find this compound or compounds like it in BindingDB:
Activity Spreadsheet -- Enzyme Inhibition Constant Data from BindingDB
Found 1 hit for monomerid = 50561618
Target4-aminobutyrate aminotransferase, mitochondrial(Sus scrofa)
Northwestern University
Curated by ChEMBL
LigandPNGBDBM50561618(CHEMBL4746439)
Affinity DataKi:  1.00E+4nM. Assay description: Binding affinity pig brain GABA-AT assessed as inactivation constant using GABA as substrate in presence of NADP+ and alpha-ketoglutarate by SSDH cou...
Ligand InfoPC cidPC sid
In DepthDetails ArticlePubMed