BDBM50561650 CHEMBL4747380
SMILES [H][C@@]12CC[C@@]([H])([C@@H](C1)Nc1cnc(cn1)C(F)(F)F)N2C(=O)c1ccc(F)cc1-c1ncccn1
InChI Key InChIKey=FJQHMTUDGQPMMX-XYPHTWIQSA-N
Data  2 KI
  Tab Delimited (TSV)   2D SDfile   Computed 3D by Vconf -m prep SDfile
Find this compound or compounds like it in BindingDB:
Activity Spreadsheet -- Enzyme Inhibition Constant Data from BindingDB
Found 2 hits for monomerid = 50561650
TargetOrexin/Hypocretin receptor type 1(Homo sapiens (Human))
Janssen Research & Development
Curated by ChEMBL
LigandPNGBDBM50561650(CHEMBL4747380)
Affinity DataKi:  61nM. Assay description: Binding affinity to human OXIR
Ligand InfoPC cidPC sid
In DepthDetails ArticlePubMed
TargetOrexin receptor type 2(Homo sapiens (Human))
Janssen Research & Development
Curated by ChEMBL
LigandPNGBDBM50561650(CHEMBL4747380)
Affinity DataKi:  1.70E+3nM. Assay description: Binding affinity to human OX2R
Ligand InfoPC cidPC sid
In DepthDetails ArticlePubMed