BDBM50561652 CHEMBL4752792
SMILES [H][C@@]12CC[C@@]([H])([C@@H](C1)Nc1ncc(cc1F)C(F)(F)F)N2C(=O)c1cccc(F)c1-c1ncccn1
InChI Key InChIKey=BDRBQQPLBCKTIO-XWIAVFTESA-N
Data  2 KI
  Tab Delimited (TSV)   2D SDfile   Computed 3D by Vconf -m prep SDfile
Find this compound or compounds like it in BindingDB:
Activity Spreadsheet -- Enzyme Inhibition Constant Data from BindingDB
Found 2 hits for monomerid = 50561652
TargetOrexin/Hypocretin receptor type 1(Homo sapiens (Human))
Janssen Research & Development
Curated by ChEMBL
LigandPNGBDBM50561652(CHEMBL4752792)
Affinity DataKi:  15nM. Assay description: Binding affinity to human OXIR
Ligand InfoPC cidPC sid
In DepthDetails ArticlePubMed
TargetOrexin receptor type 2(Homo sapiens (Human))
Janssen Research & Development
Curated by ChEMBL
LigandPNGBDBM50561652(CHEMBL4752792)
Affinity DataKi:  1.10E+3nM. Assay description: Binding affinity to human OX2R
Ligand InfoPC cidPC sid
In DepthDetails ArticlePubMed