BDBM50562919 CHEMBL4780397
SMILES [H][C@]12OC[C@H](Nc3nccc(n3)-c3ccc(OC)cc3)[C@@]1([H])OC[C@@H]2NC(=O)Nc1cccc(c1)C(F)(F)F
InChI Key InChIKey=QPDCXRYGMHLPCF-FNAHDJPLSA-N
Data  1 IC50
  Tab Delimited (TSV)   2D SDfile   Computed 3D by Vconf -m prep SDfile
Find this compound or compounds like it in BindingDB:
Activity Spreadsheet -- Enzyme Inhibition Constant Data from BindingDB
Found 1 hit for monomerid = 50562919
TargetGlycogen synthase kinase-3 beta(Homo sapiens (Human))
University Of Central Lancashire
Curated by ChEMBL
LigandPNGBDBM50562919(CHEMBL4780397)
Affinity DataIC50:  9.75E+3nM. Assay description: Inhibition of recombinant human GSK-3beta using phosphorylated polypeptide as substrate incubated for 30 mins in presence of ATP by kinase-glo lumine...
Ligand InfoPC cidPC sid
In DepthDetails ArticlePubMed