BDBM50562923 CHEMBL4782972
SMILES [H][C@]12CC(NC(=O)Nc3cccc(SC)c3)N(CC1CN(C)c1ccccc1)CCC2
InChI Key InChIKey=OWNRLNHQKCYPSN-HGCBZUSOSA-N
Data  1 IC50
  Tab Delimited (TSV)   2D SDfile   Computed 3D by Vconf -m prep SDfile
Find this compound or compounds like it in BindingDB:
Activity Spreadsheet -- Enzyme Inhibition Constant Data from BindingDB
Found 1 hit for monomerid = 50562923
TargetGlycogen synthase kinase-3 beta(Homo sapiens (Human))
University Of Central Lancashire
Curated by ChEMBL
LigandPNGBDBM50562923(CHEMBL4782972)
Affinity DataIC50: >5.00E+4nM. Assay description: Inhibition of recombinant human GSK-3beta using phosphorylated polypeptide as substrate incubated for 30 mins in presence of ATP by kinase-glo lumine...
Ligand InfoPC cidPC sid
In DepthDetails ArticlePubMed