BDBM50562931 CHEMBL4787122
SMILES CC(=O)Nc1ccc(CN2C[C@@H](F)[C@H](C2)OCc2nc3cc(C)c(C)cc3[nH]2)cc1
InChI Key InChIKey=BTFQJFZPYGOKLE-KNQAVFIVSA-N
Data  1 IC50
  Tab Delimited (TSV)   2D SDfile   Computed 3D by Vconf -m prep SDfile
Find this compound or compounds like it in BindingDB:
Activity Spreadsheet -- Enzyme Inhibition Constant Data from BindingDB
Found 1 hit for monomerid = 50562931
TargetGlycogen synthase kinase-3 beta(Homo sapiens (Human))
University Of Central Lancashire
Curated by ChEMBL
LigandPNGBDBM50562931(CHEMBL4787122)
Affinity DataIC50: >5.00E+4nM. Assay description: Inhibition of recombinant human GSK-3beta using phosphorylated polypeptide as substrate incubated for 30 mins in presence of ATP by kinase-glo lumine...
Ligand InfoPC cidPC sid
In DepthDetails ArticlePubMed