BDBM50562936 CHEMBL4741666
SMILES COc1ccc(cc1)C(=O)N1C[C@@H](F)[C@H](C1)OCc1nc2cc(ccc2[nH]1)C(F)(F)F
InChI Key InChIKey=GKUOFARHISUUCP-QAPCUYQASA-N
Data  1 IC50
  Tab Delimited (TSV)   2D SDfile   Computed 3D by Vconf -m prep SDfile
Find this compound or compounds like it in BindingDB:
Activity Spreadsheet -- Enzyme Inhibition Constant Data from BindingDB
Found 1 hit for monomerid = 50562936
TargetGlycogen synthase kinase-3 beta(Homo sapiens (Human))
University Of Central Lancashire
Curated by ChEMBL
LigandPNGBDBM50562936(CHEMBL4741666)
Affinity DataIC50: >5.00E+4nM. Assay description: Inhibition of recombinant human GSK-3beta using phosphorylated polypeptide as substrate incubated for 30 mins in presence of ATP by kinase-glo lumine...
Ligand InfoPC cidPC sid
In DepthDetails ArticlePubMed