BDBM50562957 CHEMBL4778874
SMILES [H][C@]12OC[C@@H](OC(=O)Nc3cccc4ccccc34)[C@@]1([H])OC[C@@H]2NC(=S)Nc1ccc(Cl)cc1
InChI Key InChIKey=YEPZIHXHWOTWNB-DXBBTUNJSA-N
Data  1 IC50
  Tab Delimited (TSV)   2D SDfile   Computed 3D by Vconf -m prep SDfile
Find this compound or compounds like it in BindingDB:
Activity Spreadsheet -- Enzyme Inhibition Constant Data from BindingDB
Found 1 hit for monomerid = 50562957
TargetGlycogen synthase kinase-3 beta(Homo sapiens (Human))
University Of Central Lancashire
Curated by ChEMBL
LigandPNGBDBM50562957(CHEMBL4778874)
Affinity DataIC50: >5.00E+4nM. Assay description: Inhibition of recombinant human GSK-3beta using phosphorylated polypeptide as substrate incubated for 30 mins in presence of ATP by kinase-glo lumine...
Ligand InfoPC cidPC sid
In DepthDetails ArticlePubMed